Reaction Details
TargetProthrombin
LigandBDBM50118723
Substrate/Competitorn/a
Meas. Tech.ChEMBL_208329 (CHEMBL813561)
Ki 1±n/a nM
Citation Adang, AEde Man, APVogel, GMGrootenhuis, PDSmit, MJPeters, CAVisser, ARewinkel, JBvan Dinther, TLucas, HKelder, Jvan Aelst, SMeuleman, DGvan Boeckel, CA Unique overlap in the prerequisites for thrombin inhibition and oral bioavailability resulting in potent oral antithrombotics. J Med Chem45:4419-32 (2002) Prothrombin
Name:Prothrombin
Type:Protein
Mol. Mass.:70029.57
Organism:Homo sapiens (Human)
Description:P00734
Residue:622
BDBM50118723
NameBDBM50118723
Synonyms:CHEMBL342672 N-[14-Benzyl-18-(3-guanidino-propyl)-11-(4-hydroxy-benzyl)-4,8,13,16,17,20-hexaoxo-1,2,3,5,6,7,8,11,12,13,14,15,16,17,18,19,20,20a-octadecahydro-4H-3a,7,12,15,19-pentaaza-cyclopentacyclononadecen-5-yl]-formamide
TypeSmall organic molecule
Emp. Form.C36H45N9O8
Mol. Mass.731.798
SMILES[#7]\[#6](-[#7])=[#7]\[#6]-[#6]-[#6]-[#6@@H]-1-[#7]-[#6](=O)-[#6@@H]-2-[#6]-[#6]-[#6]-[#7]-2-[#6](=O)-[#6@H](-[#6]-[#7]-[#6](=O)\[#6]=[#6]\[#6@H](-[#6]-c2ccc(-[#8])cc2)-[#7]-[#6](=O)-[#6@@H](-[#6]-c2ccccc2)-[#7]-[#6](=O)-[#6]-1=O)-[#7]-[#6]=O