Reaction Details
TargetProthrombin
LigandBDBM50118724
Substrate/Competitorn/a
Meas. Tech.ChEMBL_208329 (CHEMBL813561)
Ki 146±n/a nM
Citation Adang, AEde Man, APVogel, GMGrootenhuis, PDSmit, MJPeters, CAVisser, ARewinkel, JBvan Dinther, TLucas, HKelder, Jvan Aelst, SMeuleman, DGvan Boeckel, CA Unique overlap in the prerequisites for thrombin inhibition and oral bioavailability resulting in potent oral antithrombotics. J Med Chem45:4419-32 (2002) Prothrombin
Name:Prothrombin
Type:Protein
Mol. Mass.:70029.57
Organism:Homo sapiens (Human)
Description:P00734
Residue:622
BDBM50118724
NameBDBM50118724
Synonyms:(S)-1-((R)-2-Amino-3-phenyl-propionyl)-pyrrolidine-2-carboxylic acid [(S)-5-amino-1-(thiazole-2-carbonyl)-pentyl]-amide 1-(2-Amino-3-phenyl-propionyl)-pyrrolidine-2-carboxylic acid [5-amino-1-(thiazole-2-carbonyl)-pentyl]-amide | CHEMBL342850
TypeSmall organic molecule
Emp. Form.C23H31N5O3S
Mol. Mass.457.589
SMILESNCCCC[C@H](NC(=O)[C@@H]1CCCN1C(=O)[C@H](N)Cc1ccccc1)C(=O)c1nccs1