Reaction Details
TargetProthrombin
LigandBDBM50118728
Substrate/Competitorn/a
Meas. Tech.ChEMBL_208329 (CHEMBL813561)
Ki 0.29±n/a nM
Citation Adang, AEde Man, APVogel, GMGrootenhuis, PDSmit, MJPeters, CAVisser, ARewinkel, JBvan Dinther, TLucas, HKelder, Jvan Aelst, SMeuleman, DGvan Boeckel, CA Unique overlap in the prerequisites for thrombin inhibition and oral bioavailability resulting in potent oral antithrombotics. J Med Chem45:4419-32 (2002) Prothrombin
Name:Prothrombin
Type:Protein
Mol. Mass.:70029.57
Organism:Homo sapiens (Human)
Description:P00734
Residue:622
BDBM50118728
NameBDBM50118728
Synonyms:7-Amino-3-({1-[2-(carboxymethyl-amino)-3-cyclohexyl-propionyl]-piperidine-2-carbonyl}-amino)-2-oxo-heptanoic acid | CHEMBL337780
TypeSmall organic molecule
Emp. Form.C24H40N4O7
Mol. Mass.496.597
SMILESNCCCC[C@H](NC(=O)[C@@H]1CCCCN1C(=O)[C@@H](CC1CCCCC1)NCC(O)=O)C(=O)C(O)=O