Reaction Details
TargetProthrombin
LigandBDBM50118731
Substrate/Competitorn/a
Meas. Tech.ChEMBL_208329 (CHEMBL813561)
Ki 0.42±n/a nM
Citation Adang, AEde Man, APVogel, GMGrootenhuis, PDSmit, MJPeters, CAVisser, ARewinkel, JBvan Dinther, TLucas, HKelder, Jvan Aelst, SMeuleman, DGvan Boeckel, CA Unique overlap in the prerequisites for thrombin inhibition and oral bioavailability resulting in potent oral antithrombotics. J Med Chem45:4419-32 (2002) Prothrombin
Name:Prothrombin
Type:Protein
Mol. Mass.:70029.57
Organism:Homo sapiens (Human)
Description:P00734
Residue:622
BDBM50118731
NameBDBM50118731
Synonyms:(2-{2-[5-Amino-1-(oxazole-2-carbonyl)-pentylcarbamoyl]-pyrrolidin-1-yl}-1-cyclohexylmethyl-2-oxo-ethylamino)-acetic acid CHEMBL341581
TypeSmall organic molecule
Emp. Form.C25H39N5O6
Mol. Mass.505.6071
SMILESNCCCC[C@H](NC(=O)[C@@H]1CCCN1C(=O)[C@@H](CC1CCCCC1)NCC(O)=O)C(=O)c1ncco1