Reaction Details
TargetProthrombin
LigandBDBM50118732
Substrate/Competitorn/a
Meas. Tech.ChEMBL_208329 (CHEMBL813561)
Ki 0.3±n/a nM
Citation Adang, AEde Man, APVogel, GMGrootenhuis, PDSmit, MJPeters, CAVisser, ARewinkel, JBvan Dinther, TLucas, HKelder, Jvan Aelst, SMeuleman, DGvan Boeckel, CA Unique overlap in the prerequisites for thrombin inhibition and oral bioavailability resulting in potent oral antithrombotics. J Med Chem45:4419-32 (2002) Prothrombin
Name:Prothrombin
Type:Protein
Mol. Mass.:70029.57
Organism:Homo sapiens (Human)
Description:P00734
Residue:622
BDBM50118732
NameBDBM50118732
Synonyms:1-(2-Amino-3-phenyl-propionyl)-pyrrolidine-2-carboxylic acid [4-guanidino-1-(thiazole-2-carbonyl)-butyl]-amide | CHEMBL138763
TypeSmall organic molecule
Emp. Form.C23H31N7O3S
Mol. Mass.485.602
SMILESNC(Cc1ccccc1)C(=O)N1CCCC1C(=O)NC(CCCNC(N)=N)C(=O)c1nccs1