Reaction Details
TargetProthrombin
LigandBDBM50118734
Substrate/Competitorn/a
Meas. Tech.ChEMBL_208329 (CHEMBL813561)
Ki 28±n/a nM
Citation Adang, AEde Man, APVogel, GMGrootenhuis, PDSmit, MJPeters, CAVisser, ARewinkel, JBvan Dinther, TLucas, HKelder, Jvan Aelst, SMeuleman, DGvan Boeckel, CA Unique overlap in the prerequisites for thrombin inhibition and oral bioavailability resulting in potent oral antithrombotics. J Med Chem45:4419-32 (2002) Prothrombin
Name:Prothrombin
Type:Protein
Mol. Mass.:70029.57
Organism:Homo sapiens (Human)
Description:P00734
Residue:622
BDBM50118734
NameBDBM50118734
Synonyms:6-Amino-2-[2-(5-{[1-(2-amino-3-phenyl-propionyl)-pyrrolidine-2-carbonyl]-amino}-8-guanidino-4-oxo-octanoylamino)-3-phenyl-propionylamino]-hexanoic acid | CHEMBL141724
TypeSmall organic molecule
Emp. Form.C38H55N9O7
Mol. Mass.749.8994
SMILESNCCCC[C@H](NC(=O)[C@H](Cc1ccccc1)NC(=O)CCC(=O)[C@H](CCCNC(N)=N)NC(=O)[C@@H]1CCCN1C(=O)[C@H](N)Cc1ccccc1)C(O)=O