Reaction Details
TargetProthrombin
LigandBDBM50118735
Substrate/Competitorn/a
Meas. Tech.ChEMBL_208329 (CHEMBL813561)
Ki 0.5±n/a nM
Citation Adang, AEde Man, APVogel, GMGrootenhuis, PDSmit, MJPeters, CAVisser, ARewinkel, JBvan Dinther, TLucas, HKelder, Jvan Aelst, SMeuleman, DGvan Boeckel, CA Unique overlap in the prerequisites for thrombin inhibition and oral bioavailability resulting in potent oral antithrombotics. J Med Chem45:4419-32 (2002) Prothrombin
Name:Prothrombin
Type:Protein
Mol. Mass.:70029.57
Organism:Homo sapiens (Human)
Description:P00734
Residue:622
BDBM50118735
NameBDBM50118735
Synonyms:7-Amino-3-({1-[2-(carboxymethyl-amino)-3-cyclohexyl-propionyl]-azetidine-2-carbonyl}-amino)-2-oxo-heptanoic acid | CHEMBL138267
TypeSmall organic molecule
Emp. Form.C22H36N4O7
Mol. Mass.468.5438
SMILESNCCCC[C@H](NC(=O)[C@@H]1CCN1C(=O)[C@@H](CC1CCCCC1)NCC(O)=O)C(=O)C(O)=O