Reaction Details
TargetProthrombin
LigandBDBM50118730
Substrate/Competitorn/a
Meas. Tech.ChEMBL_208329 (CHEMBL813561)
Ki 0.21±n/a nM
Citation Adang, AEde Man, APVogel, GMGrootenhuis, PDSmit, MJPeters, CAVisser, ARewinkel, JBvan Dinther, TLucas, HKelder, Jvan Aelst, SMeuleman, DGvan Boeckel, CA Unique overlap in the prerequisites for thrombin inhibition and oral bioavailability resulting in potent oral antithrombotics. J Med Chem45:4419-32 (2002) Prothrombin
Name:Prothrombin
Type:Protein
Mol. Mass.:70029.57
Organism:Homo sapiens (Human)
Description:P00734
Residue:622
BDBM50118730
NameBDBM50118730
Synonyms:7-Amino-3-(2-{[2-(carboxymethyl-amino)-3-cyclohexyl-propionyl]-cyclopentyl-amino}-acetylamino)-2-oxo-heptanoic acid | CHEMBL343794
TypeSmall organic molecule
Emp. Form.C25H42N4O7
Mol. Mass.510.6236
SMILESNCCCC[C@H](NC(=O)CN(C1CCCC1)C(=O)[C@@H](CC1CCCCC1)NCC(O)=O)C(=O)C(O)=O