Reaction Details
TargetProthrombin
LigandBDBM29388
Substrate/Competitorn/a
Meas. Tech.ChEMBL_208329 (CHEMBL813561)
Ki 2±n/a nM
Citation Adang, AEde Man, APVogel, GMGrootenhuis, PDSmit, MJPeters, CAVisser, ARewinkel, JBvan Dinther, TLucas, HKelder, Jvan Aelst, SMeuleman, DGvan Boeckel, CA Unique overlap in the prerequisites for thrombin inhibition and oral bioavailability resulting in potent oral antithrombotics. J Med Chem45:4419-32 (2002) Prothrombin
Name:Prothrombin
Type:Protein
Mol. Mass.:70029.57
Organism:Homo sapiens (Human)
Description:P00734
Residue:622
BDBM29388
NameBDBM29388
Synonyms:Exanta US11584714, Compound 999
TypeSmall organic molecule
Emp. Form.C22H31N5O4
Mol. Mass.429.5126
SMILESNC(=N)c1ccc(CNC(=O)[C@@H]2CCN2C(=O)[C@H](NCC(O)=O)C2CCCCC2)cc1