Reaction Details
TargetProthrombin
LigandBDBM50118736
Substrate/Competitorn/a
Meas. Tech.ChEMBL_208329 (CHEMBL813561)
Ki>1000±n/a nM
Citation Adang, AEde Man, APVogel, GMGrootenhuis, PDSmit, MJPeters, CAVisser, ARewinkel, JBvan Dinther, TLucas, HKelder, Jvan Aelst, SMeuleman, DGvan Boeckel, CA Unique overlap in the prerequisites for thrombin inhibition and oral bioavailability resulting in potent oral antithrombotics. J Med Chem45:4419-32 (2002) Prothrombin
Name:Prothrombin
Type:Protein
Mol. Mass.:70029.57
Organism:Homo sapiens (Human)
Description:P00734
Residue:622
BDBM50118736
NameBDBM50118736
Synonyms:7-Methoxy-naphthalene-2-sulfonic acid [5-amino-1-(4-methyl-piperidine-1-carbonyl)-pentyl]-amide | CHEMBL139247
TypeSmall organic molecule
Emp. Form.C23H33N3O4S
Mol. Mass.447.591
SMILESCOc1ccc2ccc(cc2c1)S(=O)(=O)N[C@@H](CCCCN)C(=O)N1CCC(C)CC1