Reaction Details
TargetDisintegrin and metalloproteinase domain-containing protein 9
LigandBDBM50109624
Substrate/Competitorn/a
Meas. Tech.ChEMBL_63593 (CHEMBL675240)
IC50 520±n/a nM
Citation Sawa, MKiyoi, TKurokawa, KKumihara, HYamamoto, MMiyasaka, TIto, YHirayama, RInoue, TKirii, YNishiwaki, EOhmoto, HMaeda, YIshibushi, EInoue, YYoshino, KKondo, H New type of metalloproteinase inhibitor: design and synthesis of new phosphonamide-based hydroxamic acids. J Med Chem45:919-29 (2002) Disintegrin and metalloproteinase domain-containing protein 9
Name:Disintegrin and metalloproteinase domain-containing protein 9
Type:Enzyme
Mol. Mass.:90567.68
Organism:Homo sapiens (Human)
Description:Q13443
Residue:819
BDBM50109624
NameBDBM50109624
Synonyms:(6-Hydroxycarbamoyl-6,7-dihydro-4H-thieno[3,2-c]pyridin-5-yl)-(4-methoxy-phenyl)-phosphinic acid ethyl ester | CHEMBL173316
TypeSmall organic molecule
Emp. Form.C17H21N2O5PS
Mol. Mass.396.398
SMILESCCOP(=O)(N1Cc2ccsc2CC1C(=O)NO)c1ccc(OC)cc1