Reaction Details
TargetDisintegrin and metalloproteinase domain-containing protein 9
LigandBDBM50109635
Substrate/Competitorn/a
Meas. Tech.ChEMBL_63593 (CHEMBL675240)
IC50 260±n/a nM
Citation Sawa, MKiyoi, TKurokawa, KKumihara, HYamamoto, MMiyasaka, TIto, YHirayama, RInoue, TKirii, YNishiwaki, EOhmoto, HMaeda, YIshibushi, EInoue, YYoshino, KKondo, H New type of metalloproteinase inhibitor: design and synthesis of new phosphonamide-based hydroxamic acids. J Med Chem45:919-29 (2002) Disintegrin and metalloproteinase domain-containing protein 9
Name:Disintegrin and metalloproteinase domain-containing protein 9
Type:Enzyme
Mol. Mass.:90567.68
Organism:Homo sapiens (Human)
Description:Q13443
Residue:819
BDBM50109635
NameBDBM50109635
Synonyms:(3-Hydroxycarbamoyl-3,4-dihydro-1H-isoquinolin-2-yl)-(4-phenoxy-phenyl)-phosphinic acid ethyl ester | CHEMBL355797
TypeSmall organic molecule
Emp. Form.C24H25N2O5P
Mol. Mass.452.4395
SMILESCCOP(=O)(N1Cc2ccccc2CC1C(=O)NO)c1ccc(Oc2ccccc2)cc1