Reaction Details
TargetInterstitial collagenase
LigandBDBM50109617
Substrate/Competitorn/a
Meas. Tech.ChEMBL_106139 (CHEMBL718686)
Ki 7.33±n/a nM
Citation Sawa, MKiyoi, TKurokawa, KKumihara, HYamamoto, MMiyasaka, TIto, YHirayama, RInoue, TKirii, YNishiwaki, EOhmoto, HMaeda, YIshibushi, EInoue, YYoshino, KKondo, H New type of metalloproteinase inhibitor: design and synthesis of new phosphonamide-based hydroxamic acids. J Med Chem45:919-29 (2002) Interstitial collagenase
Name:Interstitial collagenase
Type:Enzyme
Mol. Mass.:54010.26
Organism:Homo sapiens (Human)
Description: P03956
Residue:469
BDBM50109617
NameBDBM50109617
Synonyms:(3-Hydroxycarbamoyl-3,4-dihydro-1H-isoquinolin-2-yl)-(4-methoxy-phenyl)-phosphinic acid 2-biphenyl-4-yl-ethyl ester | CHEMBL173754
TypeSmall organic molecule
Emp. Form.C31H31N2O5P
Mol. Mass.542.562
SMILESCOc1ccc(cc1)P(=O)(OCCc1ccc(cc1)-c1ccccc1)N1Cc2ccccc2CC1C(=O)NO