Reaction Details
TargetMatrix metalloproteinase-9
LigandBDBM50109631
Substrate/Competitorn/a
Meas. Tech.ChEMBL_105387 (CHEMBL710806)
Ki 3.42±n/a nM
Citation Sawa, MKiyoi, TKurokawa, KKumihara, HYamamoto, MMiyasaka, TIto, YHirayama, RInoue, TKirii, YNishiwaki, EOhmoto, HMaeda, YIshibushi, EInoue, YYoshino, KKondo, H New type of metalloproteinase inhibitor: design and synthesis of new phosphonamide-based hydroxamic acids. J Med Chem45:919-29 (2002) Matrix metalloproteinase-9
Name:Matrix metalloproteinase-9
Type:Enzyme
Mol. Mass.:78452.28
Organism:Homo sapiens (Human)
Description:P14780
Residue:707
BDBM50109631
NameBDBM50109631
Synonyms:(3-Hydroxycarbamoyl-3,4-dihydro-1H-isoquinolin-2-yl)-(4-methoxy-phenyl)-phosphinic acid 2-pyridin-2-yl-ethyl ester | CHEMBL173027
TypeSmall organic molecule
Emp. Form.C24H26N3O5P
Mol. Mass.467.4541
SMILESCOc1ccc(cc1)P(=O)(OCCc1ccccn1)N1Cc2ccccc2CC1C(=O)NO