Reaction Details
TargetStromelysin-1
LigandBDBM50109630
Substrate/Competitorn/a
Meas. Tech.ChEMBL_104748 (CHEMBL715873)
Ki 2.95±n/a nM
Citation Sawa, MKiyoi, TKurokawa, KKumihara, HYamamoto, MMiyasaka, TIto, YHirayama, RInoue, TKirii, YNishiwaki, EOhmoto, HMaeda, YIshibushi, EInoue, YYoshino, KKondo, H New type of metalloproteinase inhibitor: design and synthesis of new phosphonamide-based hydroxamic acids. J Med Chem45:919-29 (2002) Stromelysin-1
Name:Stromelysin-1
Type:Enzyme
Mol. Mass.:53973.13
Organism:Homo sapiens (Human)
Description: P08254
Residue:477
BDBM50109630
NameBDBM50109630
Synonyms:(3-Hydroxycarbamoyl-3,4-dihydro-1H-isoquinolin-2-yl)-(4-methoxy-phenyl)-phosphinic acid methyl ester | CHEMBL170315
TypeSmall organic molecule
Emp. Form.C18H21N2O5P
Mol. Mass.376.3435
SMILESCOc1ccc(cc1)P(=O)(OC)N1Cc2ccccc2CC1C(=O)NO