Reaction Details
TargetMatrix metalloproteinase-9
LigandBDBM50109639
Substrate/Competitorn/a
Meas. Tech.ChEMBL_105387 (CHEMBL710806)
Ki 6.57±n/a nM
Citation Sawa, MKiyoi, TKurokawa, KKumihara, HYamamoto, MMiyasaka, TIto, YHirayama, RInoue, TKirii, YNishiwaki, EOhmoto, HMaeda, YIshibushi, EInoue, YYoshino, KKondo, H New type of metalloproteinase inhibitor: design and synthesis of new phosphonamide-based hydroxamic acids. J Med Chem45:919-29 (2002) Matrix metalloproteinase-9
Name:Matrix metalloproteinase-9
Type:Enzyme
Mol. Mass.:78452.28
Organism:Homo sapiens (Human)
Description:P14780
Residue:707
BDBM50109639
NameBDBM50109639
Synonyms:(3-Hydroxycarbamoyl-3,4-dihydro-1H-isoquinolin-2-yl)-(4-methoxy-phenyl)-phosphinic acid hexyl ester | CHEMBL170429
TypeSmall organic molecule
Emp. Form.C23H31N2O5P
Mol. Mass.446.4764
SMILESCCCCCCOP(=O)(N1Cc2ccccc2CC1C(=O)NO)c1ccc(OC)cc1