Reaction Details
TargetMatrix metalloproteinase-9
LigandBDBM50109633
Substrate/Competitorn/a
Meas. Tech.ChEMBL_105387 (CHEMBL710806)
Ki 1.13±n/a nM
Citation Sawa, MKiyoi, TKurokawa, KKumihara, HYamamoto, MMiyasaka, TIto, YHirayama, RInoue, TKirii, YNishiwaki, EOhmoto, HMaeda, YIshibushi, EInoue, YYoshino, KKondo, H New type of metalloproteinase inhibitor: design and synthesis of new phosphonamide-based hydroxamic acids. J Med Chem45:919-29 (2002) Matrix metalloproteinase-9
Name:Matrix metalloproteinase-9
Type:Enzyme
Mol. Mass.:78452.28
Organism:Homo sapiens (Human)
Description:P14780
Residue:707
BDBM50109633
NameBDBM50109633
Synonyms:(3-Hydroxycarbamoyl-1,3,4,9-tetrahydro-beta-carbolin-2-yl)-(4-methoxy-phenyl)-phosphinic acid ethyl ester | CHEMBL172249
TypeSmall organic molecule
Emp. Form.C21H24N3O5P
Mol. Mass.429.4061
SMILESCCOP(=O)(N1Cc2[nH]c3ccccc3c2CC1C(=O)NO)c1ccc(OC)cc1