Reaction Details
TargetSerine/threonine-protein phosphatase PP1-gamma catalytic subunit
LigandBDBM50110681
Substrate/Competitorn/a
Meas. Tech.ChEMBL_197995 (CHEMBL798973)
IC50 0.45±n/a nM
Citation McCluskey, ASim, ATSakoff, JA Serine-threonine protein phosphatase inhibitors: development of potential therapeutic strategies. J Med Chem45:1151-75 (2002) Serine/threonine-protein phosphatase PP1-gamma catalytic subunit
Name:Serine/threonine-protein phosphatase PP1-gamma catalytic subunit
Type:PROTEIN
Mol. Mass.:36983.39
Organism:Homo sapiens (Human)
Description:ChEMBL_473188
Residue:323
BDBM50110681
NameBDBM50110681
Synonyms:CHEMBL430266 | Calyculin-A
TypeSmall organic molecule
Emp. Form.C50H81N4O15P
Mol. Mass.1009.1697
SMILESCOC[C@@H]([C@H](O)[C@H](O)C(=O)NCC[C@H](C)c1nc(\C=C\C[C@@H]2O[C@]3(C[C@@H](O)[C@@H]2C)O[C@H]([C@H](C[C@H](O)[C@H](C)[C@H](O)[C@H](C)\C=C(/C)\C(\C)=C\C=C\C(\C)=C/C#N)OC)[C@H](OP(O)(O)=O)C3(C)C)co1)N(C)C