Reaction Details
TargetCarbonic anhydrase 2
LigandBDBM50292007
Substrate/Competitorn/a
Meas. Tech.ChEMBL_45044 (CHEMBL658042)
Ki 2±n/a nM
Citation Scozzafava, AMenabuoni, LMincione, FSupuran, CT Carbonic anhydrase inhibitors. A general approach for the preparation of water-soluble sulfonamides incorporating polyamino-polycarboxylate tails and of their metal complexes possessing long-lasting, topical intraocular pressure-lowering properties. J Med Chem45:1466-76 (2002) Carbonic anhydrase 2
Name:Carbonic anhydrase 2
Type:Enzyme
Mol. Mass.:29250.71
Organism:Homo sapiens (Human)
Description:P00918
Residue:260
BDBM50292007
NameBDBM50292007
Synonyms:CHEMBL1795064 {{2-[2-(2-{Carboxymethyl-[(5-sulfamoyl-[1,3,4]thiadiazol-2-ylcarbamoyl)-methyl]-amino}-ethoxy)-ethoxy]-ethyl}-[(5-sulfamoyl-[1,3,4]thiadiazol-2-ylcarbamoyl)-methyl]-amino}-acetic acid {{2-[2-(2-{Carboxymethyl-[(5-sulfamoyl-[1,3,4]thiadiazol-2-ylcarbamoyl)-methyl]-amino}-ethoxy)-ethoxy]-ethyl}-[(5-sulfamoyl-[1,3,4]thiadiazol-2-ylcarbamoyl)-methyl]-amino}-acetic acid; compound with Cu complex | {{2-[2-(2-{Carboxymethyl-[(5-sulfamoyl-[1,3,4]thiadiazol-2-ylcarbamoyl)-methyl]-amino}-ethoxy)-ethoxy]-ethyl}-[(5-sulfamoyl-[1,3,4]thiadiazol-2-ylcarbamoyl)-methyl]-amino}-acetic acid; compound with Zn complex
TypeSmall organic molecule
Emp. Form.C18H28N10O12S4
Mol. Mass.704.735
SMILESNS(=O)(=O)c1nnc(NC(=O)CN(CCOCCOCCN(CC(O)=O)CC(=O)Nc2nnc(s2)S(N)(=O)=O)CC(O)=O)s1