Reaction Details
TargetP-selectin glycoprotein ligand 1
LigandBDBM50111451
Substrate/Competitorn/a
Meas. Tech.ChEMBL_148143 (CHEMBL755250)
IC50 2500000±n/a nM
Citation Kaila, NChen, LThomas, BETsao, DTam, SBedard, PWCamphausen, RTAlvarez, JCUllas, G Beta-C-mannosides as selectin inhibitors. J Med Chem45:1563-6 (2002) P-selectin glycoprotein ligand 1
Name:P-selectin glycoprotein ligand 1
Type:PROTEIN
Mol. Mass.:43174.76
Organism:Homo sapiens (Human)
Description:ChEMBL_649756
Residue:412
BDBM50111451
NameBDBM50111451
Synonyms:2-[2-(3,4,5-Trihydroxy-6-{[2-(1-phenyl-ethylcarbamoyl)-benzoylamino]-methyl}-tetrahydro-pyran-2-yl)-acetylamino]-pentanedioic acid | CHEMBL288811
TypeSmall organic molecule
Emp. Form.C29H35N3O11
Mol. Mass.601.6017
SMILESC[C@@H](NC(=O)c1ccccc1C(=O)NCC1OC(CC(=O)N[C@@H](CCC(O)=O)C(O)=O)C(O)C(O)C1O)c1ccccc1