Reaction Details
TargetBeta-lactamase
LigandBDBM50065297
Substrate/Competitorn/a
Meas. Tech.ChEMBL_216014 (CHEMBL881597)
IC50 6000±n/a nM
Citation McGovern, SLCaselli, EGrigorieff, NShoichet, BK A common mechanism underlying promiscuous inhibitors from virtual and high-throughput screening. J Med Chem45:1712-22 (2002) Beta-lactamase
Name:Beta-lactamase
Type:Protien
Mol. Mass.:41561.62
Organism:Escherichia coli
Description:P00811
Residue:377
BDBM50065297
NameBDBM50065297
Synonyms:3-(4-Isopropyl-benzylidene)-1,3-dihydro-indol-2-one CHEMBL48760
TypeSmall organic molecule
Emp. Form.C18H17NO
Mol. Mass.263.3337
SMILESCC(C)c1ccc(\C=C2\C(=O)Nc3ccccc23)cc1