Reaction Details
TargetChymotrypsin-C
LigandBDBM7460
Substrate/Competitorn/a
Meas. Tech.ChEMBL_49925 (CHEMBL664294)
IC50 100000±n/a nM
Citation McGovern, SLCaselli, EGrigorieff, NShoichet, BK A common mechanism underlying promiscuous inhibitors from virtual and high-throughput screening. J Med Chem45:1712-22 (2002) Chymotrypsin-C
Name:Chymotrypsin-C
Type:Enzyme
Mol. Mass.:29487.98
Organism:Homo sapiens (Human)
Description:Q99895
Residue:268
BDBM7460
NameBDBM7460
Synonyms:2-(3,4-dihydroxyphenyl)-3,5,7-trihydroxy-4H-chromen-4-one 2-(3,4-dihydroxyphenyl)-3,5,7-trihydroxy-chromone;hydrate Quercetin Quercetin (21) US11021454, Compound Quercetin med.21724, Compound 4
TypeSmall organic molecule
Emp. Form.C15H10O7
Mol. Mass.302.2357
SMILESOc1cc(O)c2c(c1)oc(-c1ccc(O)c(O)c1)c(O)c2=O