Reaction Details
TargetEndothelin-1 receptor
LigandBDBM50122686
Substrate/Competitorn/a
Meas. Tech.ChEMBL_65652 (CHEMBL678072)
Ki 0.005±n/a nM
Citation Murugesan, NGu, ZSpergel, SYoung, MChen, PMathur, ALeith, LHermsmeier, MLiu, ECZhang, RBird, EWaldron, TMarino, AKoplowitz, BHumphreys, WGChong, SMorrison, RAWebb, MLMoreland, STrippodo, NBarrish, JC Biphenylsulfonamide endothelin receptor antagonists. 4. Discovery of N-[[2'-[[(4,5-dimethyl-3-isoxazolyl)amino]sulfonyl]-4-(2-oxazolyl)[1,1'-biphenyl]- 2-yl]methyl]-N,3,3-trimethylbutanamide (BMS-207940), a highly potent and orally active ET(A) selective antagonist. J Med Chem46:125-37 (2002) 
 
Endothelin-1 receptor
Name:Endothelin-1 receptor
Type:Enzyme Catalytic Domain
Mol. Mass.:48736.88
Organism:Homo sapiens (Human)
Description:P25101
Residue:427
BDBM50122686
NameBDBM50122686
Synonyms:1-Methyl-1H-indole-2-carboxylic acid [2'-(3,4-dimethyl-isoxazol-5-ylsulfamoyl)-4-oxazol-2-yl-biphenyl-2-ylmethyl]-methyl-amide | CHEMBL281977
TypeSmall organic molecule
Emp. Form.C32H29N5O5S
Mol. Mass.595.668
SMILESCN(Cc1cc(ccc1-c1ccccc1S(=O)(=O)Nc1onc(C)c1C)-c1ncco1)C(=O)c1cc2ccccc2n1C