Reaction Details
TargetCannabinoid receptor 2
LigandBDBM50128095
Substrate/Competitorn/a
Meas. Tech.ChEMBL_46981 (CHEMBL659748)
Ki 29±n/a nM
Citation Wrobleski, STChen, PHynes, JLin, SNorris, DJPandit, CRSpergel, SWu, HTokarski, JSChen, XGillooly, KMKiener, PAMcIntyre, KWPatil-Koota, VShuster, DJTurk, LAYang, GLeftheris, K Rational design and synthesis of an orally active indolopyridone as a novel conformationally constrained cannabinoid ligand possessing antiinflammatory properties. J Med Chem46:2110-6 (2003) 
 
Cannabinoid receptor 2
Name:Cannabinoid receptor 2
Type:G Protein-Coupled Receptor (GPCR)
Mol. Mass.:39690.94
Organism:Homo sapiens (Human)
Description:P34972
Residue:360
BDBM50128095
NameBDBM50128095
Synonyms:7-Methoxy-2-methyl-1-(2-morpholin-4-yl-ethyl)-1H-indole-3-carboxylic acid (1,3,3-trimethyl-bicyclo[2.2.1]hept-2-yl)-amide | CHEMBL431363
TypeSmall organic molecule
Emp. Form.C27H39N3O3
Mol. Mass.453.6169
SMILESCOc1cccc2c(C(=O)NC3[C@@]4(C)CC[C@H](C4)C3(C)C)c(C)n(CCN3CCOCC3)c12