Reaction Details
TargetCannabinoid receptor 2
LigandBDBM50128100
Substrate/Competitorn/a
Meas. Tech.ChEMBL_46981 (CHEMBL659748)
Ki 11±n/a nM
Citation Wrobleski, STChen, PHynes, JLin, SNorris, DJPandit, CRSpergel, SWu, HTokarski, JSChen, XGillooly, KMKiener, PAMcIntyre, KWPatil-Koota, VShuster, DJTurk, LAYang, GLeftheris, K Rational design and synthesis of an orally active indolopyridone as a novel conformationally constrained cannabinoid ligand possessing antiinflammatory properties. J Med Chem46:2110-6 (2003) 
 
Cannabinoid receptor 2
Name:Cannabinoid receptor 2
Type:G Protein-Coupled Receptor (GPCR)
Mol. Mass.:39690.94
Organism:Homo sapiens (Human)
Description:P34972
Residue:360
BDBM50128100
NameBDBM50128100
Synonyms:7-Methoxy-1-(2-morpholin-4-yl-ethyl)-1H-indole-3-carboxylic acid (1,3,3-trimethyl-bicyclo[2.2.1]hept-2-yl)-amide | CHEMBL68288
TypeSmall organic molecule
Emp. Form.C26H37N3O3
Mol. Mass.439.5903
SMILESCOc1cccc2c(cn(CCN3CCOCC3)c12)C(=O)NC1[C@@]2(C)CC[C@H](C2)C1(C)C