Reaction Details
TargetCannabinoid receptor 2
LigandBDBM50128096
Substrate/Competitorn/a
Meas. Tech.ChEMBL_46981 (CHEMBL659748)
Ki 69±n/a nM
Citation Wrobleski, STChen, PHynes, JLin, SNorris, DJPandit, CRSpergel, SWu, HTokarski, JSChen, XGillooly, KMKiener, PAMcIntyre, KWPatil-Koota, VShuster, DJTurk, LAYang, GLeftheris, K Rational design and synthesis of an orally active indolopyridone as a novel conformationally constrained cannabinoid ligand possessing antiinflammatory properties. J Med Chem46:2110-6 (2003) 
 
Cannabinoid receptor 2
Name:Cannabinoid receptor 2
Type:G Protein-Coupled Receptor (GPCR)
Mol. Mass.:39690.94
Organism:Homo sapiens (Human)
Description:P34972
Residue:360
BDBM50128096
NameBDBM50128096
Synonyms:7-Methoxy-1-(2-morpholin-4-yl-ethyl)-1H-indazole-3-carboxylic acid (2-chloro-6-fluoro-benzyl)-isopropyl-amide | CHEMBL67006
TypeSmall organic molecule
Emp. Form.C25H30ClFN4O3
Mol. Mass.488.982
SMILESCOc1cccc2c(nn(CCN3CCOCC3)c12)C(=O)N(Cc1c(F)cccc1Cl)C(C)C