Reaction Details
TargetProtein farnesyltransferase subunit beta/geranylgeranyltransferase type-1 subunit alpha
LigandBDBM50370231
Substrate/Competitorn/a
Meas. Tech.ChEMBL_70431 (CHEMBL681288)
IC50 1.4±n/a nM
Citation deSolms, SJCiccarone, TMMacTough, SCShaw, AWBuser, CAEllis-Hutchings, MFernandes, CHamilton, KAHuber, HEKohl, NELobell, RBRobinson, RGTsou, NNWalsh, ESGraham, SLBeese, LSTaylor, JS Dual protein farnesyltransferase-geranylgeranyltransferase-I inhibitors as potential cancer chemotherapeutic agents. J Med Chem46:2973-84 (2003) 
 
Protein farnesyltransferase subunit beta/geranylgeranyltransferase type-1 subunit alpha
Name:Protein farnesyltransferase subunit beta/geranylgeranyltransferase type-1 subunit alpha
Type:Protein Complex
Mol. Mass.:n/a
Description:To express recombinant enzyme in E. coli, the cloned human alpha and beta subunits were co-expressed from a plasmid, in which their expression was translationally coupled.
Components:This complex has 2 components.
Component 1
Name:Protein farnesyltransferase subunit beta
Synonyms:CAAX farnesyltransferase subunit alpha FNTB FTase-alpha GGTase-I-alpha Protein farnesyl/geranylgeranyl transferase Protein farnesyltransferase subunit beta Protein farnesyltransferase/geranylgeranyltransferase type-1 subunit alpha Ras proteins prenyltransferase subunit beta | Type I protein geranyl-geranyltransferase subunit alpha
Type:Enzyme Subunit
Mol. Mass.:48766.02
Organism:Homo sapiens (Human)
Description:Protein farnesyltransferase subunit beta
Residue:437
Component 2
Name:Protein farnesyltransferase/geranylgeranyltransferase type-1 subunit alpha
Synonyms:CAAX farnesyltransferase alpha subunit FNTA_HUMAN FTase-alpha Geranylgeranyl Transferase (GGTase-I) Chain A Protein Farnesyltransferase (PFT) Chain A Protein farnesyltransferase Protein farnesyltransferase/geranylgeranyltransferase type I alpha subunit | Ras proteins prenyltransferase alpha
Type:Enzyme
Mol. Mass.:44392.46
Organism:Homo sapiens (Human)
Description:Recombinant human FTase.
Residue:379
BDBM50370231
NameBDBM50370231
Synonyms:CHEMBL1907916
TypeSmall organic molecule
Emp. Form.C26H28N4O2
Mol. Mass.428.5261
SMILESCC[C@]1(CCCCN(C)C1=O)c1cccc(Oc2cc(Cn3ccnc3)ccc2C#N)c1