Reaction Details
TargetProthrombin
LigandBDBM50111101
Substrate/Competitorn/a
Meas. Tech.ChEMBL_208359 (CHEMBL813669)
Ki 0.003±n/a nM
Citation Lee, KPark, CWJung, WHPark, HDLee, SHChung, KHPark, SKKwon, OHKang, MPark, DHLee, SKKim, EEYoon, SKKim, A Efficacious and orally bioavailable thrombin inhibitors based on a 2,5-thienylamidine at the P1 position: discovery of N-carboxymethyl-d-diphenylalanyl-l-prolyl[(5-amidino-2-thienyl)methyl]amide. J Med Chem46:3612-22 (2003) 
 
Prothrombin
Name:Prothrombin
Type:Protein
Mol. Mass.:70029.57
Organism:Homo sapiens (Human)
Description:P00734
Residue:622
BDBM50111101
NameBDBM50111101
Synonyms:(S)-1-((R)-2-Methanesulfonylamino-3,3-diphenyl-propionyl)-pyrrolidine-2-carboxylic acid 4-carbamimidoyl-benzylamide CHEMBL269575
TypeSmall organic molecule
Emp. Form.C29H33N5O4S
Mol. Mass.547.668
SMILESCS(=O)(=O)N[C@H](C(c1ccccc1)c1ccccc1)C(=O)N1CCC[C@H]1C(=O)NCc1ccc(cc1)C(N)=N