Reaction Details
TargetProthrombin
LigandBDBM50131788
Substrate/Competitorn/a
Meas. Tech.ChEMBL_208359 (CHEMBL813669)
Ki 0.6±n/a nM
Citation Lee, KPark, CWJung, WHPark, HDLee, SHChung, KHPark, SKKwon, OHKang, MPark, DHLee, SKKim, EEYoon, SKKim, A Efficacious and orally bioavailable thrombin inhibitors based on a 2,5-thienylamidine at the P1 position: discovery of N-carboxymethyl-d-diphenylalanyl-l-prolyl[(5-amidino-2-thienyl)methyl]amide. J Med Chem46:3612-22 (2003) 
 
Prothrombin
Name:Prothrombin
Type:Protein
Mol. Mass.:70029.57
Organism:Homo sapiens (Human)
Description:P00734
Residue:622
BDBM50131788
NameBDBM50131788
Synonyms:(1-Benzhydryl-2-{2-[(5-carbamimidoyl-thiophen-3-ylmethyl)-carbamoyl]-pyrrolidin-1-yl}-2-oxo-ethyl)-carbamic acid methyl ester | CHEMBL121379
TypeSmall organic molecule
Emp. Form.C28H31N5O4S
Mol. Mass.533.642
SMILESCOC(=O)N[C@H](C(c1ccccc1)c1ccccc1)C(=O)N1CCC[C@H]1C(=O)NCc1csc(c1)C(N)=N