Reaction Details
TargetCollagenase 3
LigandBDBM30344
Substrate/Competitorn/a
Meas. Tech.ChEMBL_106606 (CHEMBL717443)
IC50 3.4±n/a nM
Citation Le Diguarher, TChollet, AMBertrand, MHennig, PRaimbaud, ESabatini, MGuilbaud, NPierré, ATucker, GCCasara, P Stereospecific synthesis of 5-substituted 2-bisarylthiocyclopentane carboxylic acids as specific matrix metalloproteinase inhibitors. J Med Chem46:3840-52 (2003) 
 
Collagenase 3
Name:Collagenase 3
Type:Enzyme
Mol. Mass.:53808.06
Organism:Homo sapiens (Human)
Description:P45452
Residue:471
BDBM30344
NameBDBM30344
Synonyms:Cipemastat | Trocade
TypeSmall organic molecule
Emp. Form.C22H36N4O5
Mol. Mass.436.545
SMILESCN1C(=O)N(C[C@@H]([C@@H](CC2CCCC2)C(=O)N2CCCCC2)C(=O)NO)C(=O)C1(C)C