Reaction Details
TargetStromelysin-1
LigandBDBM50131962
Substrate/Competitorn/a
Meas. Tech.ChEMBL_104732 (CHEMBL874161)
IC50 694±n/a nM
Citation Le Diguarher, TChollet, AMBertrand, MHennig, PRaimbaud, ESabatini, MGuilbaud, NPierré, ATucker, GCCasara, P Stereospecific synthesis of 5-substituted 2-bisarylthiocyclopentane carboxylic acids as specific matrix metalloproteinase inhibitors. J Med Chem46:3840-52 (2003) 
 
Stromelysin-1
Name:Stromelysin-1
Type:Enzyme
Mol. Mass.:53973.13
Organism:Homo sapiens (Human)
Description: P08254
Residue:477
BDBM50131962
NameBDBM50131962
Synonyms:2-(4'-Chloro-biphenyl-4-sulfonyl)-5-(4-oxo-4H-benzo[d][1,2,3]triazin-3-ylmethyl)-cyclopentanecarboxylic acid | CHEMBL341249
TypeSmall organic molecule
Emp. Form.C26H22ClN3O5S
Mol. Mass.523.988
SMILESOC(=O)[C@H]1[C@H](Cn2nnc3ccccc3c2=O)CC[C@@H]1S(=O)(=O)c1ccc(cc1)-c1ccc(Cl)cc1