Reaction Details
Target72 kDa type IV collagenase
LigandBDBM50131964
Substrate/Competitorn/a
Meas. Tech.ChEMBL_104390 (CHEMBL714993)
IC50 1.7±n/a nM
Citation Le Diguarher, TChollet, AMBertrand, MHennig, PRaimbaud, ESabatini, MGuilbaud, NPierré, ATucker, GCCasara, P Stereospecific synthesis of 5-substituted 2-bisarylthiocyclopentane carboxylic acids as specific matrix metalloproteinase inhibitors. J Med Chem46:3840-52 (2003) 
 
72 kDa type IV collagenase
Name:72 kDa type IV collagenase
Type:Enzyme
Mol. Mass.:73870.36
Organism:Homo sapiens (Human)
Description: P08253
Residue:660
BDBM50131964
NameBDBM50131964
Synonyms:2-(4'-Chloro-biphenyl-4-ylsulfanyl)-5-(3-oxo-6,7,8,9-tetrahydro-5H-[1,2,4]triazolo[4,3-a]azepin-2-ylmethyl)-cyclopentanecarboxylic acid | CHEMBL127138
TypeSmall organic molecule
Emp. Form.C26H28ClN3O3S
Mol. Mass.498.037
SMILESOC(=O)[C@H]1[C@H](Cn2nc3CCCCCn3c2=O)CC[C@@H]1Sc1ccc(cc1)-c1ccc(Cl)cc1