Reaction Details
TargetDelta-type opioid receptor
LigandBDBM21864
Substrate/Competitorn/a
Meas. Tech.ChEMBL_147029 (CHEMBL753670)
Ki 0.160000±n/a nM
Citation Anzini, MCanullo, LBraile, CCappelli, AGallelli, AVomero, SMenziani, MCDe Benedetti, PGRizzo, MCollina, SAzzolina, OSbacchi, MGhelardini, CGaleotti, N Synthesis, biological evaluation, and receptor docking simulations of 2-[(acylamino)ethyl]-1,4-benzodiazepines as kappa-opioid receptor agonists endowed with antinociceptive and antiamnesic activity. J Med Chem46:3853-64 (2003) 
 
Delta-type opioid receptor
Name:Delta-type opioid receptor
Type:G Protein-Coupled Receptor (GPCR)
Mol. Mass.:40382.98
Organism:Homo sapiens (Human)
Description:Competition binding assays were carried out using membrane preparations from transfected HN9.10 cells that constitutively expressed the delta opioid receptor.
Residue:372
BDBM21864
NameBDBM21864
Synonyms:(21R)-22-(cyclopropylmethyl)-14-oxa-11,22-diazaheptacyclo[13.9.1.0^{1,13}.0^{2,21}.0^{4,12}.0^{5,10}.0^{19,25}]pentacosa-4(12),5,7,9,15,17,19(25)-heptaene-2,16-diol NALTRINDOLE | [3H]-naltrindole
Typeradiolabeled ligand
Emp. Form.C26H26N2O3
Mol. Mass.414.4962
SMILES[H][C@@]12Cc3ccc(O)c4OC5c6[nH]c7ccccc7c6CC1(O)C5(CCN2CC1CC1)c34