Reaction Details
TargetKappa-type opioid receptor
LigandBDBM50049808
Substrate/Competitorn/a
Meas. Tech.ChEMBL_146382 (CHEMBL754739)
Ki 4.7±n/a nM
Citation Anzini, MCanullo, LBraile, CCappelli, AGallelli, AVomero, SMenziani, MCDe Benedetti, PGRizzo, MCollina, SAzzolina, OSbacchi, MGhelardini, CGaleotti, N Synthesis, biological evaluation, and receptor docking simulations of 2-[(acylamino)ethyl]-1,4-benzodiazepines as kappa-opioid receptor agonists endowed with antinociceptive and antiamnesic activity. J Med Chem46:3853-64 (2003) 
 
Kappa-type opioid receptor
Name:Kappa-type opioid receptor
Type:G Protein-Coupled Receptor (GPCR)
Mol. Mass.:42744.99
Organism:Cavia porcellus (domestic guinea pig)
Description:P41144
Residue:380
BDBM50049808
NameBDBM50049808
Synonyms:CHEMBL127968 | N-[2-(7-Chloro-1-methyl-5-phenyl-2,3-dihydro-1H-benzo[e][1,4]diazepin-2-yl)-ethyl]-4-fluoro-benzamide
TypeSmall organic molecule
Emp. Form.C25H23ClFN3O
Mol. Mass.435.921
SMILESCN1C(CCNC(=O)c2ccc(F)cc2)CN=C(c2ccccc2)c2cc(Cl)ccc12