Reaction Details
TargetMu-type opioid receptor
LigandBDBM50049806
Substrate/Competitorn/a
Meas. Tech.ChEMBL_145160 (CHEMBL753420)
Ki 6.4±n/a nM
Citation Anzini, MCanullo, LBraile, CCappelli, AGallelli, AVomero, SMenziani, MCDe Benedetti, PGRizzo, MCollina, SAzzolina, OSbacchi, MGhelardini, CGaleotti, N Synthesis, biological evaluation, and receptor docking simulations of 2-[(acylamino)ethyl]-1,4-benzodiazepines as kappa-opioid receptor agonists endowed with antinociceptive and antiamnesic activity. J Med Chem46:3853-64 (2003) 
 
Mu-type opioid receptor
Name:Mu-type opioid receptor
Type:Enzyme Catalytic Domain
Mol. Mass.:11165.58
Organism:GUINEA PIG
Description:P97266
Residue:98
BDBM50049806
NameBDBM50049806
Synonyms:CHEMBL127969 | Thiophene-2-carboxylic acid [2-(1-methyl-5-phenyl-2,3-dihydro-1H-benzo[e][1,4]diazepin-2-yl)-ethyl]-amide
TypeSmall organic molecule
Emp. Form.C23H23N3OS
Mol. Mass.389.513
SMILESCN1C(CCNC(=O)c2cccs2)CN=C(c2ccccc2)c2ccccc12