Reaction Details
TargetDelta-type opioid receptor
LigandBDBM50131968
Substrate/Competitorn/a
Meas. Tech.ChEMBL_145474 (CHEMBL751261)
Ki 69±n/a nM
Citation Anzini, MCanullo, LBraile, CCappelli, AGallelli, AVomero, SMenziani, MCDe Benedetti, PGRizzo, MCollina, SAzzolina, OSbacchi, MGhelardini, CGaleotti, N Synthesis, biological evaluation, and receptor docking simulations of 2-[(acylamino)ethyl]-1,4-benzodiazepines as kappa-opioid receptor agonists endowed with antinociceptive and antiamnesic activity. J Med Chem46:3853-64 (2003) 
 
Delta-type opioid receptor
Name:Delta-type opioid receptor
Type:G Protein-Coupled Receptor (GPCR)
Mol. Mass.:40382.98
Organism:Homo sapiens (Human)
Description:Competition binding assays were carried out using membrane preparations from transfected HN9.10 cells that constitutively expressed the delta opioid receptor.
Residue:372
BDBM50131968
NameBDBM50131968
Synonyms:CHEMBL127828 | Thiophene-3-carboxylic acid {2-[5-(2-fluoro-phenyl)-1-methyl-2,3-dihydro-1H-benzo[e][1,4]diazepin-2-yl]-ethyl}-amide
TypeSmall organic molecule
Emp. Form.C23H22FN3OS
Mol. Mass.407.504
SMILESCN1C(CCNC(=O)c2ccsc2)CN=C(c2ccccc2F)c2ccccc12