Reaction Details
TargetKappa-type opioid receptor
LigandBDBM50131969
Substrate/Competitorn/a
Meas. Tech.ChEMBL_146382 (CHEMBL754739)
Ki 1.7±n/a nM
Citation Anzini, MCanullo, LBraile, CCappelli, AGallelli, AVomero, SMenziani, MCDe Benedetti, PGRizzo, MCollina, SAzzolina, OSbacchi, MGhelardini, CGaleotti, N Synthesis, biological evaluation, and receptor docking simulations of 2-[(acylamino)ethyl]-1,4-benzodiazepines as kappa-opioid receptor agonists endowed with antinociceptive and antiamnesic activity. J Med Chem46:3853-64 (2003) 
 
Kappa-type opioid receptor
Name:Kappa-type opioid receptor
Type:G Protein-Coupled Receptor (GPCR)
Mol. Mass.:42744.99
Organism:Cavia porcellus (domestic guinea pig)
Description:P41144
Residue:380
BDBM50131969
NameBDBM50131969
Synonyms:CHEMBL126688 | Thiophene-2-carboxylic acid [2-(5-phenyl-2,3-dihydro-1H-benzo[e][1,4]diazepin-2-yl)-ethyl]-amide
TypeSmall organic molecule
Emp. Form.C22H21N3OS
Mol. Mass.375.487
SMILESO=C(NCCC1CN=C(c2ccccc2)c2ccccc2N1)c1cccs1