Reaction Details
TargetKappa-type opioid receptor
LigandBDBM50131966
Substrate/Competitorn/a
Meas. Tech.ChEMBL_145244 (CHEMBL755694)
Ki 3.8±n/a nM
Citation Anzini, MCanullo, LBraile, CCappelli, AGallelli, AVomero, SMenziani, MCDe Benedetti, PGRizzo, MCollina, SAzzolina, OSbacchi, MGhelardini, CGaleotti, N Synthesis, biological evaluation, and receptor docking simulations of 2-[(acylamino)ethyl]-1,4-benzodiazepines as kappa-opioid receptor agonists endowed with antinociceptive and antiamnesic activity. J Med Chem46:3853-64 (2003) 
 
Kappa-type opioid receptor
Name:Kappa-type opioid receptor
Type:G Protein-Coupled Receptor (GPCR)
Mol. Mass.:42648.76
Organism:Homo sapiens (Human)
Description:P41145
Residue:380
BDBM50131966
NameBDBM50131966
Synonyms:CHEMBL126596 | Thiophene-2-carboxylic acid [2-(6-methoxy-1-methyl-5-phenyl-2,3-dihydro-1H-benzo[e][1,4]diazepin-2-yl)-ethyl]-amide
TypeSmall organic molecule
Emp. Form.C24H25N3O2S
Mol. Mass.419.539
SMILESCOc1cccc2N(C)C(CCNC(=O)c3cccs3)CN=C(c3ccccc3)c12