Reaction Details
TargetKappa-type opioid receptor
LigandBDBM50049802
Substrate/Competitorn/a
Meas. Tech.ChEMBL_146382 (CHEMBL754739)
Ki 0.560000±n/a nM
Citation Anzini, MCanullo, LBraile, CCappelli, AGallelli, AVomero, SMenziani, MCDe Benedetti, PGRizzo, MCollina, SAzzolina, OSbacchi, MGhelardini, CGaleotti, N Synthesis, biological evaluation, and receptor docking simulations of 2-[(acylamino)ethyl]-1,4-benzodiazepines as kappa-opioid receptor agonists endowed with antinociceptive and antiamnesic activity. J Med Chem46:3853-64 (2003) 
 
Kappa-type opioid receptor
Name:Kappa-type opioid receptor
Type:G Protein-Coupled Receptor (GPCR)
Mol. Mass.:42744.99
Organism:Cavia porcellus (domestic guinea pig)
Description:P41144
Residue:380
BDBM50049802
NameBDBM50049802
Synonyms:4-Fluoro-N-[2-(1-methyl-5-phenyl-2,3-dihydro-1H-benzo[e][1,4]diazepin-2-yl)-ethyl]-benzamide | CHEMBL127463
TypeSmall organic molecule
Emp. Form.C25H24FN3O
Mol. Mass.401.476
SMILESCN1C(CCNC(=O)c2ccc(F)cc2)CN=C(c2ccccc2)c2ccccc12