Reaction Details
TargetProtein kinase C gamma type
LigandBDBM50133058
Substrate/Competitorn/a
Meas. Tech.ChEMBL_161149 (CHEMBL767417)
IC50>10000±n/a nM
Citation Kuo, GHProuty, CDeAngelis, AShen, LO'Neill, DJShah, CConnolly, PJMurray, WVConway, BRCheung, PWestover, LXu, JZLook, RADemarest, KTEmanuel, SMiddleton, SAJolliffe, LBeavers, MPChen, X Synthesis and discovery of macrocyclic polyoxygenated bis-7-azaindolylmaleimides as a novel series of potent and highly selective glycogen synthase kinase-3beta inhibitors. J Med Chem46:4021-31 (2003) 
 
Protein kinase C gamma type
Name:Protein kinase C gamma type
Type:Enzyme
Mol. Mass.:78458.05
Organism:Homo sapiens (Human)
Description:The recombinant human PKC enzymes were produced using a baculovirus expression system in SF9 cells
Residue:697
BDBM50133058
NameBDBM50133058
Synonyms:17,20,23,26-tetraoxa-4,12,14,29,31-pentaazahexacyclo[27.6.1.17,14.02,6.08,13.030,35]heptatriaconta-1(36),2(6),7(37),8,10,12,30,32,34-nonaene-3,5-dione | CHEMBL337642
TypeSmall organic molecule
Emp. Form.C28H29N5O6
Mol. Mass.531.5598
SMILESO=C1NC(=O)C2=C1c1cn(CCOCCOCCOCCOCCn3cc2c2cccnc32)c2ncccc12