Reaction Details
TargetGlycogen synthase kinase-3 beta
LigandBDBM50133066
Substrate/Competitorn/a
Meas. Tech.ChEMBL_71153 (CHEMBL684979)
IC50 620±n/a nM
Citation Kuo, GHProuty, CDeAngelis, AShen, LO'Neill, DJShah, CConnolly, PJMurray, WVConway, BRCheung, PWestover, LXu, JZLook, RADemarest, KTEmanuel, SMiddleton, SAJolliffe, LBeavers, MPChen, X Synthesis and discovery of macrocyclic polyoxygenated bis-7-azaindolylmaleimides as a novel series of potent and highly selective glycogen synthase kinase-3beta inhibitors. J Med Chem46:4021-31 (2003) 
 
Glycogen synthase kinase-3 beta
Name:Glycogen synthase kinase-3 beta
Type:Enzyme
Mol. Mass.:46756.38
Organism:Homo sapiens (Human)
Description:P49841
Residue:420
BDBM50133066
NameBDBM50133066
Synonyms:17,20-dioxa-4,12,14,23,25-pentaazahexacyclo[21.6.1.17,14.02,6.08,13.024,29]hentriaconta-1(30),2(6),7(31),8,10,12,24,26,28-nonaene-3,5-dione | CHEMBL132223
TypeSmall organic molecule
Emp. Form.C24H21N5O4
Mol. Mass.443.4546
SMILESO=C1NC(=O)C2=C1c1cn(CCOCCOCCn3cc2c2cccnc32)c2ncccc12