Reaction Details
TargetGlycogen synthase kinase-3 beta
LigandBDBM50133065
Substrate/Competitorn/a
Meas. Tech.ChEMBL_71153 (CHEMBL684979)
IC50 51±n/a nM
Citation Kuo, GHProuty, CDeAngelis, AShen, LO'Neill, DJShah, CConnolly, PJMurray, WVConway, BRCheung, PWestover, LXu, JZLook, RADemarest, KTEmanuel, SMiddleton, SAJolliffe, LBeavers, MPChen, X Synthesis and discovery of macrocyclic polyoxygenated bis-7-azaindolylmaleimides as a novel series of potent and highly selective glycogen synthase kinase-3beta inhibitors. J Med Chem46:4021-31 (2003) 
 
Glycogen synthase kinase-3 beta
Name:Glycogen synthase kinase-3 beta
Type:Enzyme
Mol. Mass.:46756.38
Organism:Homo sapiens (Human)
Description:P49841
Residue:420
BDBM50133065
NameBDBM50133065
Synonyms:17,20,23,26,29-pentaoxa-4,14,32-triazahexacyclo[30.6.1.17,14.02,6.08,13.033,38]tetraconta-1(39),2(6),7(40),8,10,12,33,35,37-nonaene-3,5-dione | CHEMBL130774
TypeSmall organic molecule
Emp. Form.C32H35N3O7
Mol. Mass.573.6362
SMILESO=C1NC(=O)C2=C1c1cn(CCOCCOCCOCCOCCOCCn3cc2c2ccccc32)c2ccccc12