Reaction Details
TargetCoagulation factor X
LigandBDBM50135961
Substrate/Competitorn/a
Meas. Tech.ChEMBL_48828 (CHEMBL661801)
Ki 1.7±n/a nM
Citation Pruitt, JRPinto, DJGalemmo, RAAlexander, RSRossi, KAWells, BLDrummond, SBostrom, LLBurdick, DBruckner, RChen, HSmallwood, AWong, PCWright, MRBai, SLuettgen, JMKnabb, RMLam, PYWexler, RR Discovery of 1-(2-aminomethylphenyl)-3-trifluoromethyl-N- [3-fluoro-2'-(aminosulfonyl)[1,1'-biphenyl)]-4-yl]-1H-pyrazole-5-carboxyamide (DPC602), a potent, selective, and orally bioavailable factor Xa inhibitor(1). J Med Chem46:5298-315 (2003) 
 
Coagulation factor X
Name:Coagulation factor X
Type:Enzyme
Mol. Mass.:54726.60
Organism:Homo sapiens (Human)
Description:n/a
Residue:488
BDBM50135961
NameBDBM50135961
Synonyms:2-(2-Aminomethyl-4-methoxy-phenyl)-5-trifluoromethyl-2H-pyrazole-3-carboxylic acid (2'-methanesulfonyl-biphenyl-4-yl)-amide | CHEMBL151201
TypeSmall organic molecule
Emp. Form.C26H23F3N4O4S
Mol. Mass.544.545
SMILESCOc1ccc(c(CN)c1)-n1nc(cc1C(=O)Nc1ccc(cc1)-c1ccccc1S(C)(=O)=O)C(F)(F)F