Reaction Details
TargetNitric oxide synthase, inducible
LigandBDBM50124519
Substrate/Competitorn/a
Meas. Tech.ChEMBL_89194 (CHEMBL701146)
IC50 2±n/a nM
Citation Tinker, ACBeaton, HGBoughton-Smith, NCook, TRCooper, SLFraser-Rae, LHallam, KHamley, PMcInally, TNicholls, DJPimm, ADWallace, AV 1,2-Dihydro-4-quinazolinamines: potent, highly selective inhibitors of inducible nitric oxide synthase which show antiinflammatory activity in vivo. J Med Chem46:913-6 (2003) 
 
Nitric oxide synthase, inducible
Name:Nitric oxide synthase, inducible
Type:Homodimer
Mol. Mass.:131141.95
Organism:Homo sapiens (Human)
Description:P35228
Residue:1153
BDBM50124519
NameBDBM50124519
Synonyms:5,8-Difluoro-2-furan-2-yl-1,2-dihydro-quinazolin-4-ylamine | CHEMBL354788
TypeSmall organic molecule
Emp. Form.C12H9F2N3O
Mol. Mass.249.2162
SMILESNC1=NC(Nc2c(F)ccc(F)c12)c1ccco1