Reaction Details
TargetMitogen-activated protein kinase 11/12/13/14
LigandBDBM13336
Substrate/Competitorn/a
Meas. Tech.ChEMBL_124327 (CHEMBL732635)
IC50 50±n/a nM
Citation McGovern, SLShoichet, BK Kinase inhibitors: not just for kinases anymore. J Med Chem46:1478-83 (2003) 
 
Mitogen-activated protein kinase 11/12/13/14
Name:Mitogen-activated protein kinase 11/12/13/14
Synonyms:MAP kinase p38
Type:n/a
Mol. Mass.:n/a
Description:ASSAY_ID of ChEMBL is 1935922
Components:This complex has 4 components.
Component 1
Name:Mitogen-activated protein kinase 13
Type:Enzyme
Mol. Mass.:42097.16
Organism:Homo sapiens (Human)
Description:O15264
Residue:365
Component 2
Name:Mitogen-activated protein kinase 11
Synonyms:MAP kinase p38 MK11_HUMAN Mitogen-activated protein kinase p38 beta SAPK2 Stress-activated protein kinase 2 p38-2 p38b
Type:Enzyme Catalytic Domain
Mol. Mass.:41351.73
Organism:Homo sapiens (Human)
Description:gi_20128774
Residue:364
Component 3
Name:Mitogen-activated protein kinase 14
Synonyms:CSAID-binding protein CSBP1 CSPB1 MAP kinase 14 MAP kinase p38 alpha MAPK14 MK14_HUMAN Mitogen-activated protein kinase p38 alpha Stress-activated protein kinase 2a | p38 MAP kinase alpha/beta
Type:Serine/threonine-protein kinase
Mol. Mass.:41286.76
Organism:Homo sapiens (Human)
Description:Q16539
Residue:360
Component 4
Name:Mitogen-activated protein kinase 12
Synonyms:ERK6 MAPK12 Mitogen-activated protein kinase 12 (MAPK12 p38 gamma) Mitogen-activated protein kinase 12 Gamma SAPK3 | p38 delta/gamma
Type:Protein
Mol. Mass.:41938.69
Organism:Homo sapiens (Human)
Description:P53778
Residue:367
BDBM13336
NameBDBM13336
Synonyms:4-[4-(4-fluorophenyl)-2-(4-methanesulfinylphenyl)-1H-imidazol-5-yl]pyridine 4-{4-(4-fluorophenyl)-2-[4-(methylsulfinyl)phenyl]-1H-imidazol-5-yl}pyridine SB-203580 cid_176155
TypeSmall organic molecule
Emp. Form.C21H16FN3OS
Mol. Mass.377.435
SMILESCS(=O)c1ccc(cc1)-c1nc(c([nH]1)-c1ccc(F)cc1)-c1ccncc1