Reaction Details
TargetChymotrypsinogen B
LigandBDBM2581
Substrate/Competitorn/a
Meas. Tech.ChEMBL_49607 (CHEMBL661258)
IC50 10000±n/a nM
Citation McGovern, SLShoichet, BK Kinase inhibitors: not just for kinases anymore. J Med Chem46:1478-83 (2003) 
 
Chymotrypsinogen B
Name:Chymotrypsinogen B
Type:PROTEIN
Mol. Mass.:27871.19
Organism:Homo sapiens (Human)
Description:ChEMBL_216634
Residue:263
BDBM2581
NameBDBM2581
Synonyms:3,13,23-triazahexacyclo[14.7.0.0^{2,10}.0^{4,9}.0^{11,15}.0^{17,22}]tricosa-1(16),2(10),4(9),5,7,11(15),17(22),18,20-nonaen-12-one K-252c
TypeSmall organic molecule
Emp. Form.C20H13N3O
Mol. Mass.311.3367
SMILESO=C1NCc2c1c1c3ccccc3[nH]c1c1[nH]c3ccccc3c21