Reaction Details
TargetSerine/threonine-protein kinase N2
LigandBDBM14029
Substrate/Competitorn/a
Meas. Tech.ChEMBL_161440 (CHEMBL772574)
IC50 600±n/a nM
Citation McGovern, SLShoichet, BK Kinase inhibitors: not just for kinases anymore. J Med Chem46:1478-83 (2003) 
 
Serine/threonine-protein kinase N2
Name:Serine/threonine-protein kinase N2
Type:PROTEIN
Mol. Mass.:112029.78
Organism:Homo sapiens (Human)
Description:ChEMBL_1433151
Residue:984
BDBM14029
NameBDBM14029
Synonyms:(R)-TRANS-4-(1-AMINOETHYL)-N-(4-PYRIDYL) CYCLOHEXANECARBOXAMIDE US10183931, Y-27632 | Y-27632
TypeSmall organic molecule
Emp. Form.C14H21N3O
Mol. Mass.247.336
SMILES[H][C@@]1(CC[C@@]([H])(CC1)C(=O)Nc1ccncc1)[C@@H](C)N