Reaction Details
TargetHistamine N-methyltransferase
LigandBDBM50126884
Substrate/Competitorn/a
Meas. Tech.ChEMBL_87236 (CHEMBL696456)
IC50 10400±n/a nM
Citation Mikó, TLigneau, XPertz, HHGanellin, CRArrang, JMSchwartz, JCSchunack, WStark, H Novel nonimidazole histamine H3 receptor antagonists: 1-(4-(phenoxymethyl)benzyl)piperidines and related compounds. J Med Chem46:1523-30 (2003) 
 
Histamine N-methyltransferase
Name:Histamine N-methyltransferase
Type:PROTEIN
Mol. Mass.:33931.03
Organism:Rattus norvegicus
Description:ChEMBL_87236
Residue:295
BDBM50126884
NameBDBM50126884
Synonyms:1-[4-(4-Piperidin-1-ylmethyl-benzyloxy)-phenyl]-ethanone; compound with oxalic acid | CHEMBL39603
TypeSmall organic molecule
Emp. Form.C21H25NO2
Mol. Mass.323.4287
SMILESCC(=O)c1ccc(OCc2ccc(CN3CCCCC3)cc2)cc1