Reaction Details
TargetCarbonic anhydrase 2
LigandBDBM50144813
Substrate/Competitorn/a
Meas. Tech.ChEMBL_45042 (CHEMBL658040)
Ki 1.5±n/a nM
Citation de Leval, XIlies, MCasini, ADogné, JMScozzafava, AMasini, EMincione, FStarnotti, MSupuran, CT Carbonic anhydrase inhibitors: synthesis and topical intraocular pressure lowering effects of fluorine-containing inhibitors devoid of enhanced reactivity. J Med Chem47:2796-804 (2004) 
 
Carbonic anhydrase 2
Name:Carbonic anhydrase 2
Type:Enzyme
Mol. Mass.:29250.71
Organism:Homo sapiens (Human)
Description:P00918
Residue:260
BDBM50144813
NameBDBM50144813
Synonyms:2,3,5,6-Tetrafluoro-N-(2-fluoro-4-sulfamoyl-phenyl)-benzamide | CHEMBL74491
TypeSmall organic molecule
Emp. Form.C13H7F5N2O3S
Mol. Mass.366.263
SMILESNS(=O)(=O)c1ccc(NC(=O)c2c(F)c(F)cc(F)c2F)c(F)c1