Reaction Details
TargetStromelysin-1
LigandBDBM50146816
Substrate/Competitorn/a
Meas. Tech.ChEMBL_104892 (CHEMBL715750)
IC50>100000±n/a nM
Citation Breuer, ESalomon, CJKatz, YChen, WLu, SRöschenthaler, GVHadar, RReich, R Carbamoylphosphonates, a new class of in vivo active matrix metalloproteinase inhibitors. 1. Alkyl- and cycloalkylcarbamoylphosphonic acids. J Med Chem47:2826-32 (2004) 
 
Stromelysin-1
Name:Stromelysin-1
Type:Enzyme
Mol. Mass.:53973.13
Organism:Homo sapiens (Human)
Description: P08254
Residue:477
BDBM50146816
NameBDBM50146816
Synonyms:(cyclopentylamino)carbonylphosphonic acid | CHEMBL316997
TypeSmall organic molecule
Emp. Form.C6H12NO4P
Mol. Mass.193.1375
SMILESOP(O)(=O)C(=O)NC1CCCC1